Astronomy
notation: missionsAstroSCI
type: Concept
type: NamedIndividual
narrower: Herschel

isLeafConcept
definition: The :isLeafConcept property marks whether a SKOS concept is a leaf SKOS concept.

ESA Data Ontology
type: ConceptScheme
type: Ontology

Herschel
broader: Astronomy
is leaf concept: true
in scheme: ESA Data Ontology
definition: Herschel was launched on 14 May 2009! It is the fourth 'cornerstone' mission in the ESA science programme. With a 3.5 m Cassegrain telescope it is the largest space telescope ever launched. It is performing photometry and spectroscopy in approximately the 55-671 µm range, bridging the gap between earlier infrared space missions and ground based facilities.
modified: 2023-05-08T18:00:00+00:00
type: Concept