Astronomy
notation: missionsAstroSCI
type: Concept
type: NamedIndividual
narrower: Hubble Space Telescope

isLeafConcept
definition: The :isLeafConcept property marks whether a SKOS concept is a leaf SKOS concept.

ESA Data Ontology
type: ConceptScheme
type: Ontology

Hubble Space Telescope
broader: Astronomy
is leaf concept: true
in scheme: ESA Data Ontology
definition: Launched in 1990, the NASA/ESA Hubble Space Telescope remains the premier UV and visible light telescope in orbit. With well over 1.4 million observations from 10 different scientific instruments, the ESA Hubble Science Archive is a treasure trove of astronomical data to be exploited.
modified: 2023-05-08T18:00:00+00:00
type: Concept