Astronomy
notation: missionsAstroSCI
type: Concept
type: NamedIndividual
narrower: ISO

ESA Data Ontology
type: ConceptScheme
type: Ontology

ISO
broader: Astronomy
in scheme: ESA Data Ontology
definition: The Infrared Space Observatory (ISO) was the world's first true orbiting infrared observatory. Equipped with four highly-sophisticated and versatile scientific instruments, it was launched by Ariane in November 1995 and provided astronomers world-wide with a facility of unprecedented sensitivity and capabilities for a detailed exploration of the Universe at infrared wavelengths.
modified: 2023-05-08T18:00:00+00:00
type: Concept