Heliophysics
notation: missionsHelioSCI
type: Concept
type: NamedIndividual
narrower: SMILE

isLeafConcept
definition: The :isLeafConcept property marks whether a SKOS concept is a leaf SKOS concept.

ESA Data Ontology
type: ConceptScheme
type: Ontology

SMILE
broader: Heliophysics
is leaf concept: true
in scheme: ESA Data Ontology
definition: SMILE is a joint mission between the European Space Agency (ESA) and the Chinese Academy of Sciences (CAS). SMILE will image for the first time in soft X-rays and EUV up to 40 hours per orbit continously, improving our understanding of the dynamic interaction between the solar wind and with the Earth's magnetosphere. The mission will observe the solar wind interaction with the magnetosphere with its X-ray and ultraviolet cameras (SXI and UVI), gathering simultaneous images and videos of the dayside magnetopause (where Earth's magnetosphere meets the solar wind), the polar cusps (a region in each hemisphere where particles from the solar wind have direct access to Earth's ionosphere), and the auroral oval (the region around each geomagnetic pole where auroras most often occur). SMILE will also gather simultaneously in situ measurements of the solar wind with the two other instruments making up its payload – an ion analyser (LIA) and a magnetometer (MAG). These instruments will monitor the ions in the solar wind and magnetosheath, and detect changes in the local magnetic field.
modified: 2023-05-08T18:00:00+00:00
type: Concept