UNH/WAIS
in scheme: providers
definition: The U.S ice core research community is conducting a deep ice coring project in West Antarctica to develop a unique series of interrelated climate, ice dynamics, and biologic records focused on understanding interacations among global earth systems. This project will collect a deep ice core from the West Antarctic Ice Sheet (WAIS) ice flow divide and integrate approximately 20 separate but synergistic projects to analyze the ice and interpret the records.
type: Concept

ACADEMIC
type: Concept