DENSITY
in scheme: sciencekeywords
definition: The mass per unit volume of a substance. Oceanographic shorthand for density, sigma-t, may be included as a Detailed Variable.
type: Concept

SALINITY/DENSITY
type: Concept