SNOW DEPTH
change note: 2012-07-10 15:53:23.0 [mpmorahan] insert Definition (id: null text: Pertaining to the thickness of snow pack throughout the year. language code: en);
change note: 2012-06-26 13:40:59.0 [gee-cee] Insert Concept add broader relation (SNOW DEPTH [008708ac-65a4-481a-8e03-640376f42f56,39941] - CRYOSPHERIC INDICATORS [76b8c21c-c221-4724-86ef-c07222cb152b,39899]);
in scheme: sciencekeywords
definition: Pertaining to the thickness of snow pack throughout the year.
type: Concept

CRYOSPHERIC INDICATORS
type: Concept