ORG-815-DA
change note: 2023-03-10 16:40:20.0 [sritz] insert AltLabel (id: null category: primary text: ORG-815-DA Optical Rain Gauge language code: en);
change note: 2023-03-10 16:39:37.0 [sritz] Insert Concept add broader relation (ORG-815-DA [0098e812-3fd1-4f8d-aaeb-ff22a4edf804,1246973] - Gauges [271601ce-3e85-4090-b70d-d28a70095c2d,1237995]);
change note: 2023-03-10 16:41:29.0 [sritz] insert Definition (id: null text: ORG® Optical Rain Gauge ORG-815 OSi’s ORG® (Optical Rain Gauge) is a superior tool for rain measurement. The ORG® is the only instrument available to measure true rain rate. This means you avoid the reading errors due to mechanical limitations, which plague other low- tech gauges. No other rain sensor comes close to the ORG® in performance and features. Our scintillation technology has undisputed advantages over the competition. language code: en);
definition: ORG® Optical Rain Gauge ORG-815 OSi’s ORG® (Optical Rain Gauge) is a superior tool for rain measurement. The ORG® is the only instrument available to measure true rain rate. This means you avoid the reading errors due to mechanical limitations, which plague other low- tech gauges. No other rain sensor comes close to the ORG® in performance and features. Our scintillation technology has undisputed advantages over the competition.
type: Concept
in scheme: instruments

Gauges
type: Concept