ACADEMIC
type: Concept

UDEL/GEOG/CCR
in scheme: providers
definition: University-wide Center for Climatic Research is an interdisciplinary center dedicated to bringing together scientists from the University, national, and international communities with interests in both basic and applied climatology in collaborative research. The Center emphasizes the University?s commitment to developing research in climatology and serves as an organization to attract external funding. Within the Center is an international center, sponsored by the World Meteorological Organization, dealing with issues on health and climate issues, the Office of the Delaware State Climatologist, and the Delaware Environmental Observing System. NASA, NOAA, NSF, NIGEC, and numerous state agencies and local municipalities have funded research within the Center. Website: http://www.udel.edu/Geography/CCR/ [Summary provided by the University of Delaware.]
type: Concept