NOAA
type: Concept

DOC/NOAA/NOS/CSC/CRS
in scheme: providers
definition: Through partnerships with public and private organizations, the Coastal Remote Sensing (CRS) Program delivers high-quality products useful for coastal resource management decision-making. Our products and services include * tools to deliver remotely sensed imagery and derived products * land cover and land cover change data sets * high-resolution beach topography data * benthic habitat and change data sets * tools to monitor harmful algal bloom movement * models and techniques to evaluate water quality in estuarine habitats * training modules for coastal applications * methodologies for conducting mapping projects
type: Concept