Models
type: Concept

MICOM
change note: 2022-03-11 13:10:00.0 [tstevens] insert Definition (id: null text: MICOM is a primitive equation numerical model that describes the evolution of momentum, mass, heat and salt in the ocean. language code: en);
change note: 2021-11-30 13:32:18.0 [tstevens] Move Concepts delete broader relation (null); add broader relation (MICOM [00f8ab1f-040f-40b4-ba64-9f6a4c2ca7ed,825913] - Models [0a184cdc-c074-4946-90a6-02f03c686341,835911]);
change note: 2015-08-10 14:48:31.0 [epneff] Insert Concept add broader relation (MICOM [00f8ab1f-040f-40b4-ba64-9f6a4c2ca7ed,158235] - Models/Analyses [113ecbc2-ab36-4d58-a96c-a6ce0106e749,143215]);
change note: 2015-08-10 14:49:03.0 [epneff] added long name insert AltLabel (id: null text: Miami Isopycnic Coordinate Ocean Model language code: en);
type: Concept
in scheme: platforms
definition: MICOM is a primitive equation numerical model that describes the evolution of momentum, mass, heat and salt in the ocean.