IU-PUI/ES
change note: 2013-08-27 14:02:08.0 [aaleman] added new data center insert AltLabel (id: null text: Department of Earth Sciences, Indiana University-Purdue University at Indianapolis language code: en);
change note: 2013-08-27 14:00:59.0 [aaleman] Insert Concept add broader relation (IU-PUI/ES [011eeb7b-f264-460d-8796-15613b511612,105761] - ACADEMIC [7700280b-68ee-4644-bf5e-84e7a6adf897,66467]);
in scheme: providers
definition: The Department of Earth Sciences is part of IUPUI, Indiana's main urban university, at the heart of Indiana's largest metropolitan area. Our location gives us the advantage of a large local job market for our graduates; research collaboration with government and industry leaders; and collaborations with IUPUI's other major schools. If you are interested in natural sciences that combine the most exciting aspects of laboratory and field research, you will find descriptions of many unique opportunities on these pages. Earth Sciences faculty and students are exploring Earth history and Earth processes all over the world. http://earthsciences.iupui.edu/about
type: Concept

ACADEMIC
type: Concept