V - Z
type: Concept

WDC/GSD
in scheme: projects
definition: The World Data Center for Geoinformatics and Sustainable Development (WDC- Ukraine) was created as a Ukrainian branch of the World Data Center for Solar and Terrestrial Physics of the Geophysical Center of the Russian Academy of Sciences in the structure of the Institute for Applied Systems Analysis and the National Technical University of Ukraine Kyiv Polytechnic Institute in the 2006 on the base of Agreement about the Collaboration and Scientific Exchange between Geophysical Center of the Russian Academy of Sciences and the Institute for Applied Systems Analysis of the National Technical University of Ukraine Kyiv Polytechnic Institute and is responsible for Geoinformatics and Sustainable Development. http://wdc.org.ua/en/node/216
type: Concept