DOI/USGS/WRD/OR
in scheme: providers
definition: The USGS mission is to provide water information that benefits the Nation's citizens: Publications, data, maps, and applications software. USGS Water-Resources offices are located in every State. Summary provided by http://water.usgs.gov/
type: Concept

USGS
type: Concept