RIVERS/STREAM
type: Concept

PERENNIAL STREAM/RIVER
change note: 2016-06-13 12:40:37.0 [gee-cee] insert Definition (id: null text: Pertaining to channels with water flowing in them year-round. language code: en);
change note: 2016-06-13 12:40:04.0 [gee-cee] Insert Concept add broader relation (PERENNIAL STREAM/RIVER [0236a2e0-64d6-4763-bcd1-ea8bb3a117a1,188199] - RIVERS/STREAM HABITAT [43d51c24-0523-4b65-919f-17618c7d72b4,84269]);
in scheme: sciencekeywords
definition: Pertaining to channels with water flowing in them year-round.
type: Concept