SEISMIC PROFILE
type: Concept

SEISMIC SURFACE WAVES
change note: 2017-03-10 11:15:55.0 [tstevens] update Definition (Pertaining to the measurement of shock-waves on the surface of the Earth, either generated through an earthquake, or a man-made source.);
change note: 2017-03-10 11:15:43.0 [tstevens] update Definition (Pertaining to the measurement of shockwaves on the surface of the Earth, either generated through an earthquake, or a man-made source.); update Definition (USGS);
change note: 2013-03-07 09:25:56.0 [tbs1979] Move Concepts add broader relation (SEISMIC SURFACE WAVES [02836842-3d46-46e0-a816-bd2f407f3fb3,63203] - SEISMIC PROFILE [688191e0-c70c-4cf9-a5b6-a26a2bca7198,63201]); delete broader relation (null);
in scheme: sciencekeywords
definition: Pertaining to the measurement of shock-waves on the surface of the Earth, either generated through an earthquake, or a man-made source.
type: Concept