NRL P-3
in scheme: platforms
change note: 2020-05-22 13:32:21.0 [sritz] insert AltLabel (id: null category: primary text: Aircraft operated by Naval Research Lab language code: en); insert Definition (id: null text: https://www.eol.ucar.edu/observing_facilities/nrl-p-3 language code: en);
change note: 2020-05-22 13:31:32.0 [sritz] Insert Concept add broader relation (NRL P-3 [02d1826b-a34b-4773-a61d-de91677eb8bd,560267] - Aircraft [227d9c3d-f631-402d-84ed-b8c5a562fc27,541399]);
change note: 2021-11-17 13:33:43.0 [tstevens] Move Concepts delete broader relation (null); add broader relation (NRL P-3 [02d1826b-a34b-4773-a61d-de91677eb8bd,825920] - Propeller [6175c78e-432c-4254-b442-40d3cf0f6b34,835882]);
definition: https://www.eol.ucar.edu/observing_facilities/nrl-p-3
type: Concept

Propeller
type: Concept