STEEL MEASURING TAPE
change note: 2021-08-05 17:31:30.0 [sritz] insert AltLabel (id: null category: primary text: STEEL MEASURING TAPE language code: en);
in scheme: instruments
definition: Steel Measuring Tape is an instrument used for measuring lenght. [Summary provided by ORNL DAAC]
type: Concept

Probes
type: Concept