NASA/EDU/CORE
in scheme: providers
definition: The Central Operation of Resources for Educators (CORE), established in cooperation with Lorain County Joint Vocational School, serves as the worldwide distribution center for NASA-produced multimedia materials. Summary Provided By: http://education.nasa.gov/edprograms/core/about/index.html
type: Concept

NASA
type: Concept