SLIME MOLDS
change note: 2017-03-15 11:05:13.0 [mgenazzi] Definition updated update Definition (A type of heterotrophic protistan with a life cycle that includes free-living cells that at some point congregate and differentiate into spore-bearing structures.); update Definition (Starr, C. 1997. Biology: concepts and applications. Wadsworth Publishing Company. Belmont, California. );
in scheme: sciencekeywords
definition: A type of heterotrophic protistan with a life cycle that includes free-living cells that at some point congregate and differentiate into spore-bearing structures.
type: Concept

FUNGI
type: Concept