Galileo RECEIVERS
change note: 2017-08-15 10:18:14.0 [tstevens] insert Definition (id: null text: A GALILEO Receiver is a device capable of determining a navigation solution by processing the signal broadcasted by Galileo satellites. Once the signal is acquired and tracked, the receiver application decodes the navigation message. The navigation data contain all the parameters that enable the user to perform positioning service. language code: en);
change note: 2017-08-14 15:38:24.0 [tstevens] Insert Concept add broader relation (Galileo RECEIVERS [0696d322-094f-4fa3-8015-b94effe9cbda,309963] - Galileo [bf71449f-834e-4183-9006-cf94f7eb5520,309955]);
in scheme: instruments
definition: A GALILEO Receiver is a device capable of determining a navigation solution by processing the signal broadcasted by Galileo satellites. Once the signal is acquired and tracked, the receiver application decodes the navigation message. The navigation data contain all the parameters that enable the user to perform positioning service.
type: Concept

Galileo
type: Concept