TORNADO PATH WIDTH
change note: 2016-06-28 14:01:25.0 [saritz] insert Definition (id: null text: Path length (in miles and tenths of miles) and maximum path width (in yards) will be indicated for all tornadoes, including each member of families of tornadoes, or for all segments of multi-segmented tornadoes. The length in the header-strip is the length of that particular segment in that particular county/parish. The Storm Prediction Center, NCDC or a Storm Data user can determine the entire length of a multi-segmented tornado by adding the lengths from each segment as well as using the latitude and longitude of that segment. Note that latitude and longitude are not available in the Storm Data publication, but are available on the internet in National Climatic Data Center and the Storm Prediction Center databases. language code: en);
change note: 2016-06-28 13:59:39.0 [saritz] Insert Concept add broader relation (TORNADO PATH WIDTH [069ff99d-1455-4285-83d9-4f57fb0cb635,217721] - TORNADOES [a200e677-384a-42d6-8519-1c7735f0adb9,84177]);
in scheme: sciencekeywords
definition: Path length (in miles and tenths of miles) and maximum path width (in yards) will be indicated for all tornadoes, including each member of families of tornadoes, or for all segments of multi-segmented tornadoes. The length in the header-strip is the length of that particular segment in that particular county/parish. The Storm Prediction Center, NCDC or a Storm Data user can determine the entire length of a multi-segmented tornado by adding the lengths from each segment as well as using the latitude and longitude of that segment. Note that latitude and longitude are not available in the Storm Data publication, but are available on the internet in National Climatic Data Center and the Storm Prediction Center databases.
type: Concept

TORNADOES
type: Concept