FREIBURG/IPG
in scheme: providers
definition: The IPG Freiburg (Institut f. Physische Geographie) is the Department of Physical Geography at Freiburg University, Germany. IPG's research focusses on Remote Sensing, Climatology and Glaciology. It's data holdings include data from the Antarctic Peninsula and from Southwestern Germany.
type: Concept

ACADEMIC
type: Concept