AIR QUALITY
type: Concept

CARBON MONOXIDE
in scheme: sciencekeywords
definition: A colorless, odorless, and very toxic gas; molecular formula CO. It is found in trace quantities in the natural atmosphere, but also produced by the incomplete combustion of carbonaceous gasses.
type: Concept