ENVIRONMENTAL IMPACTS
type: Concept

GAS EXPLOSIONS/LEAKS
change note: 2012-06-29 14:42:39.0 [tbs1979] update Definition (A gas explosion is defined as a process where combustion of a premixed gas-air cloud causes a rapid increase of pressure.);
change note: 2012-06-29 14:41:48.0 [tbs1979] update Definition (A gas explosion is defined as a process where combustion of a premixed gas-air, cloud causes a rapid increase of pressure.); update Definition (Global Explosion Consultants http://www.gexcon.com "Gas leak" definition adapted from the American Gas & Chemical Co. Ltd. http://www.amgas.com );
in scheme: sciencekeywords
definition: A gas explosion is defined as a process where combustion of a premixed gas-air cloud causes a rapid increase of pressure.
type: Concept