NOAA
type: Concept

DOC/NOAA/NWS/NOHRSC
in scheme: providers
definition: Source: NOAA NOHRSC, http://www.nohrsc.noaa.gov The National Operational Hydrologic Remote Sensing Center (NOHRSC) provides comprehensive snow observations, analyses, data sets and map products for the Nation. National Snow Observation Database Airborne Snow Surveys Satellite Snow Cover Mapping Snow Modeling and Data Assimilation Analyses, Maps, and Interactive Visualization Tools Integrated Snow Datasets for Geospatial Applications Applied Snow Research
type: Concept