NJ/CLIM
in scheme: providers
definition: The Office of the New Jersey State Climatologist serves as the State focal point for activities pertaining to the climate of New Jersey. Dr. David A. Robinson, New Jersey State Climatologist, directs the Office, which resides within the Center for Environmental Prediction in the New Jersey Agricultural Experiment Station at Cook College, Rutgers University. The responsibilities of the Office are to collect and archive climate data, maintain an active research program pertaining to New Jersey climate and, through various outreach programs, provide climate education and information to the citizens of New Jersey. Website: http://climate.rutgers.edu/stateclim/ [Summary provided by Rutgers University.]
type: Concept

NEW JERSEY
type: Concept