CONSORTIA/INSTITUTIONS
type: Concept

CONISMA/ULR MILANO BICOCCA
in scheme: providers
definition: The CoNISMa (National Interuniversity Consortium of Marine Sciences) Consortium promotes and coordinates research and scientific activities and their applications in the field of Marine Sciences among the 30 associated Universities.
type: Concept