UWI-MAD/SSEC/AMRC
in scheme: providers
definition: The AMRC is funded by the Office of Polar Programs at the National Science Foundation and is a part of the Space Science and Engineering Center on the University of Wisconsin - Madison campus. Information provided by: http://www.iode.org/oceanportal/detail.php?id=2244
type: Concept

ACADEMIC
type: Concept