COMMERCIAL
type: Concept

RSINC
in scheme: providers
definition: ITT Visual Information Solutions provides integrated software solutions that help scientists, engineers, researchers and medical professionals turn complex data into useful information. Our 150,000 customers from over 80 countries use IDL, ENVI and IAS to analyze data and imagery and deploy imaging applications. Summary Provided By: http://www.ittvis.com/whoweare/index.asp
type: Concept