OCEAN CHEMISTRY
type: Concept

PHOSPHATE
in scheme: sciencekeywords
definition: A charged molecule composed of one atom of phosphorus and four atoms of oxygen, PO4(-3), available to plants and phytoplankton as a nutrient.
type: Concept