NASA/GSFC/SED/ESD/TISL/LandSIPS
change note: 2016-12-27 14:51:32.0 [sritz] Insert Concept add broader relation (NASA/GSFC/SED/ESD/HBSL/BISB/LandSIPS [0b73d50d-5141-410a-869a-e5dcc783cc09,278565] - NASA [4fd0aa9d-1a80-4dde-8452-c69b5c4d08cc,249071]);
change note: 2016-12-27 14:52:11.0 [sritz] insert AltLabel (id: null text: Land Science Investigator-led Processing System, Biospheric Information Systems Branch, Hydrospheric and Biospheric Sciences Laboratory, Earth Sciences Division, Science and Exploration Directorate, Goddard Space Flight Center, NASA language code: en);
change note: 2017-06-12 14:30:32.0 [sritz] update Definition (The objective of the VIIRS (Visible Infrared Imaging Radiometer Suite) Land Product QA is to evaluate and document the science quality of products made from the remotely sensed data acquired using VIIRS. Results of quality assessment of samples of VIIRS Land products made at Land SIPS (Science Investigator Processing System) and IDPS (Interface Data Processing System) and results of evaluation of improvements to the VIIRS Land Science algorithms derived by analyzing the products made at Land SIPS using the new algorithms are placed on the web pages located at this site. https://viirsland.gsfc.nasa.gov/NASAprod.html);
change note: 2023-06-29 16:23:57.0 [sritz] update Resource (provider); update Resource (https://landweb.modaps.eosdis.nasa.gov/cgi-bin/QS/new/index.cgi);
change note: 2017-01-23 06:54:25.0 [tstevens] update AltLabel (Land Science Investigator-led Processing System, Terrestrial Information Systems Laboratory, Earth Sciences Division, Sciences and Exploration Directorate, Goddard Space Flight Center, NASA); update PrefLabel (NASA/GSFC/SED/ESD/TISL/LandSIPS );
in scheme: providers
type: Concept
definition: The objective of the VIIRS (Visible Infrared Imaging Radiometer Suite) Land Product QA is to evaluate and document the science quality of products made from the remotely sensed data acquired using VIIRS. Results of quality assessment of samples of VIIRS Land products made at Land SIPS (Science Investigator Processing System) and IDPS (Interface Data Processing System) and results of evaluation of improvements to the VIIRS Land Science algorithms derived by analyzing the products made at Land SIPS using the new algorithms are placed on the web pages located at this site. https://viirsland.gsfc.nasa.gov/NASAprod.html

NASA
type: Concept