MSS
in scheme: instruments
definition: The Multispectral Scanner (MSS) sensors were line scanning devices observing the Earth perpendicular to the orbital track. The cross-track scanning was accomplished by an oscillating mirror; six lines were scanned simultaneously in each of the four spectral bands for each mirror sweep. The forward motion of the satellite provided the along-track scan line progression. The first five Landsats carried the MSS sensor which responded to Earth-reflected sunlight in four spectral bands. Landsat 3 carried an MSS sensor with an additional band, designated band 8, that responded to thermal (heat) infrared radiation. An MSS scene had an Instantaneous Field Of View (IFOV) of 68 meters in the cross-track direction by 83 meters in the along-track direction (223.0 by 272.3 feet respectively). To understand this concept consider a ground scene composed of a single 83 by 83 meter area. The scan monitor sensor ensures that the cross-track optical scan is 185 km at nominal altitude regardless of mirror scan nonlinearity or other perturbations of mirror velocity. Cross- track image velocity was nominally 6.82 meters per microsecond. After 9.958 microseconds, the 83 by 83 meter image has moved 67.9 meters. The sample taken at this instant represented 15 meters of previous information and 68 meters of new information. Therefore, the effective IFOV of the MSS detector in the cross-track direction was considered to be 68 meters which corresponds to a nominal picture element (pixel) ground area of 68 by 83 meters at the satellite nadir point. Using the effective IFOV in area calculation eliminates the overlap in area between adjacent pixels. [Summary provided by NASA.] Group: Instrument_Details Entry_ID: MSS Group: Instrument_Identification Instrument_Category: Earth Remote Sensing Instruments Instrument_Class: Passive Remote Sensing Instrument_Type: Spectrometers/Radiometers Instrument_Subtype: Imaging Spectrometers/Radiometers Short_Name: MSS Long_Name: Multispectral Scanner End_Group Gr…
type: Concept

Imaging Spectrometers/Radiometers
type: Concept