RESOURCE DEVELOPMENT SITE
type: Concept

WIND FARM
change note: 2016-06-15 08:00:48.0 [gee-cee] insert Definition (id: null text: Pertaining to an area of land with a cluster of wind turbines for driving electrical generators. language code: en);
change note: 2016-06-15 08:00:23.0 [gee-cee] Insert Concept add broader relation (WIND FARM [0c603a5b-d5e9-4e87-a8dc-2af456678dba,188261] - RESOURCE DEVELOPMENT SITE [8f109871-e6ff-4cef-a5f8-5a3ad981923e,188257]);
in scheme: sciencekeywords
definition: Pertaining to an area of land with a cluster of wind turbines for driving electrical generators.
type: Concept