LAND MANAGEMENT
type: Concept

LAND TENURE
change note: 2012-07-11 08:45:26.0 [tbs1979] update Definition (British Columbia Ministry of Forests); update Definition (The holding, particularly as to manner or term (i.e., period of time), of a property. Land tenure may be broadly categorized into private lands, federal lands, and state lands.);
change note: 2012-06-27 13:56:40.0 [tbs1979] Move Concepts delete broader relation (null); add broader relation (LAND TENURE [0ceb5ef1-5a07-4f93-8e86-d3cc2baf5768,22341] - LAND MANAGEMENT [2be0af28-a6b8-4fce-82e4-1ad86788a4d5,21535]);
change note: 2012-06-27 13:56:19.0 [tbs1979] Cut Concepts delete broader relation (null); add broader relation (LAND TENURE [0ceb5ef1-5a07-4f93-8e86-d3cc2baf5768,22341] - Trash Can/Science Keywords [c5a4126a-8f0a-4774-9bef-c2a9f9487727,39775]);
in scheme: sciencekeywords
definition: The holding, particularly as to manner or term (i.e., period of time), of a property. Land tenure may be broadly categorized into private lands, federal lands, and state lands.
type: Concept