FRANCE
type: Concept

FR/MNHN
in scheme: providers
definition: Missions Both a scientific establishment and a public service, applying itself to research and the dissemination of knowledge, the Museum has five main founding objectives which govern and nourish all of its activities. Summary provided by http://www.mnhn.fr/museum/foffice/transverse/transverse/accueil.xsp?cl=en
type: Concept