Lidar/Laser Spectrometers
type: Concept

LASER SPECTROMETER
change note: 2021-08-04 17:28:39.0 [sritz] insert AltLabel (id: null category: primary text: LASER SPECTROMETER language code: en);
in scheme: instruments
definition: LASER SPECTROMETER are spectrometers with the added feature of laser technology to improve spectrometer?s capabilities.
type: Concept