L-3 COM/TG
in scheme: providers
definition: L-3 Communications (NYSE: LLL) completed its acquisition of The Titan Corporation (NYSE: TTN) on July 29, 2005. Headquartered in New York City, L-3 Communications is a leading provider of Intelligence, Surveillance and Reconnaissance (ISR) systems, secure communications systems, aircraft modernization, training and government services. The company is a leading merchant supplier of a broad array of high technology products, including guidance and navigation, sensors, scanners, fuzes, data links, propulsion systems, simulators, avionics, electro optics, satellite communications, electrical power equipment, encryption, signal intelligence, antennas and microwave components. L-3 also supports a variety of Homeland Security initiatives with products and services. Its customers include the Department of Defense, Department of Homeland Security, selected U.S. Government intelligence agencies and aerospace prime contractors. Summary Provided By: http://www.titan.com/about/
type: Concept

COMMERCIAL
type: Concept