SEDIMENT THICKNESS
change note: 2012-07-26 12:07:46.0 [mpmorahan] insert Definition (id: null text: The sediment thickness at any location on the continental margin is the vertical distance from the sea floor to the top of the basement at the base of the sediments, regardless of the slope of the sea floor or the slope of the top basement surface. language code: en);
change note: 2012-06-26 14:49:35.0 [gee-cee] Insert Concept add broader relation (SEDIMENT THICKNESS [0d8fc6d8-eba5-4da1-9a78-d69c23d9d78d,40021] - SEDIMENTS [0960827a-ecdb-40a0-babc-fbd6df27bb53,40017]);
in scheme: sciencekeywords
definition: The sediment thickness at any location on the continental margin is the vertical distance from the sea floor to the top of the basement at the base of the sediments, regardless of the slope of the sea floor or the slope of the top basement surface.
type: Concept

SEDIMENTS
type: Concept