ELECTRICAL
change note: 2013-03-21 11:15:23.0 [tbs1979] insert Definition (id: null text: The electrical nature of a material is characterized by its conductivity (or, inversely, its resistivity) and its dielectric constant, and coefficients that indicate the rates of change of these with temperature, frequency at which measurement is made, and so on. For rocks with a range of chemical composition as well as variable physical properties of porosity and fluid content, the values of electrical properties can vary widely. language code: en);
change note: 2013-03-07 08:11:29.0 [tbs1979] Insert Concept add broader relation (ELECTRICAL [0de2a94f-9bd1-4ad0-b5b8-4a8237d049bf,83105] - METEORITE PHYSICAL/OPTICAL PROPERTIES [3ff47a50-2f58-489b-96a7-74e1d40cf0f2,83087]);
in scheme: sciencekeywords
definition: The electrical nature of a material is characterized by its conductivity (or, inversely, its resistivity) and its dielectric constant, and coefficients that indicate the rates of change of these with temperature, frequency at which measurement is made, and so on. For rocks with a range of chemical composition as well as variable physical properties of porosity and fluid content, the values of electrical properties can vary widely.
type: Concept

METEORITE PHYSICAL/OPTICAL PROPERTIES
type: Concept