AD-A
change note: 2020-10-02 18:10:10.0 [sritz] insert AltLabel (id: null category: null text: Explorer 19 language code: en); insert AltLabel (id: null category: null text: 00714 language code: en); update Definition (AD-A Atmospheric Dynamics A (Explorer 19) Explorer 19 was the second in a series of 3.66-m inflatable spheres placed into orbit to determine atmospheric densities. Explorer 19 was launched while Explorer 9, the first satellite in the series, was still active, so that densities in two different portions of the atmosphere were sampled simultaneously. The satellite consisted of alternating layers of aluminum foil and plastic film. Uniformly distributed over the aluminum outer surface were 5.1-cm dots of white paint for thermal control. A 136.620-MHz tracking beacon, which was powered by four solar cells and was mounted on the spacecraft skin, used the electrically separated hemispheres of the balloon as an antenna. The spacecraft was successfully orbited, but its apogee was lower than planned. The beacon did not have sufficient power to be received by ground tracking stations, making it necessary to rely solely on the SAO Baker-Nunn camera network for tracking. Group: Platform_Details Entry_ID: AD-A Group: Platform_Identification Platform_Category: Earth Observation Satellites Platform_Series_or_Entity: AD (Atmospheric Dynamics) Short_Name: AD-A Long_Name: Atmosphere Dynamics A (Explorer 19) End_Group Group: Synonymous_Platform_Names Short_Name: EXPLORER 19 End_Group Group: Platform_Associated_Instruments Short_Name: OPTICAL BEACON End_Group Group: Orbit Orbit_Inclination: 78.6 degrees Period: 115.9 min Perigee: 597 km Apogee: 2391 km Orbit_Type: LEO > Low Earth Orbit > Polar Sun-Synchronous End_Group Creation_Date: 2007-08-22 Online_Resource: https://nssdc.gsfc.nasa.gov/nmc/spacecraft/display.action?id=1963-053A Group: Platform_Logistics Launch_Date: 1963-12-19 Primary_Sponsor: NASA End_Group End_Group); update Definition (https://nssdc.gsfc.nasa.gov/nmc/spacecraft/displ…
type: Concept
in scheme: platforms
alternative label: Explorer 19
alternative label: 00714
definition: AD-A Atmospheric Dynamics A (Explorer 19) Explorer 19 was the second in a series of 3.66-m inflatable spheres placed into orbit to determine atmospheric densities. Explorer 19 was launched while Explorer 9, the first satellite in the series, was still active, so that densities in two different portions of the atmosphere were sampled simultaneously. The satellite consisted of alternating layers of aluminum foil and plastic film. Uniformly distributed over the aluminum outer surface were 5.1-cm dots of white paint for thermal control. A 136.620-MHz tracking beacon, which was powered by four solar cells and was mounted on the spacecraft skin, used the electrically separated hemispheres of the balloon as an antenna. The spacecraft was successfully orbited, but its apogee was lower than planned. The beacon did not have sufficient power to be received by ground tracking stations, making it necessary to rely solely on the SAO Baker-Nunn camera network for tracking. Group: Platform_Details Entry_ID: AD-A Group: Platform_Identification Platform_Category: Earth Observation Satellites Platform_Series_or_Entity: AD (Atmospheric Dynamics) Short_Name: AD-A Long_Name: Atmosphere Dynamics A (Explorer 19) End_Group Group: Synonymous_Platform_Names Short_Name: EXPLORER 19 End_Group Group: Platform_Associated_Instruments Short_Name: OPTICAL BEACON End_Group Group: Orbit Orbit_Inclination: 78.6 degrees Period: 115.9 min Perigee: 597 km Apogee: 2391 km Orbit_Type: LEO > Low Earth Orbit > Polar Sun-Synchronous End_Group Creation_Date: 2007-08-22 Online_Resource: https://nssdc.gsfc.nasa.gov/nmc/spacecraft/display.action?id=1963-053A Group: Platform_Logistics Launch_Date: 1963-12-19 Primary_Sponsor: NASA End_Group End_Group

Atmosphere Dynamics Mission-Aeolus (ADM-Aeolus)​
type: Concept