NASA/GSFC/OSS
in scheme: providers
definition: GSFC conducts research and development in software and software technology as an essential response to the needs of GSFC missions. Under the GSFC Software Release policy, GFSC has several options for the release of GSFC developed software technologies. These options now include Open Source software release. This option is under the GSFC Open Source Agreement (NOSA). Summary Provided By: http://opensource.gsfc.nasa.gov/
type: Concept

NASA
type: Concept