LAVA COMPOSITION/TEXTURE
change note: 2013-04-02 09:38:44.0 [tbs1979] update Definition (Princeton University); update Definition (The composition and texture of molten rock outside of the Earth's crust.);
change note: 2013-03-07 09:01:37.0 [tbs1979] update PrefLabel (LAVA COMPOSITION/TEXTURE);
change note: 2013-03-07 08:54:54.0 [tbs1979] Move Concepts add broader relation (LAVA [0eb6fc71-dfb0-4451-85f7-08ceaf37c552,61653] - ERUPTION DYNAMICS [0db0e1c8-6ba3-40c4-97c2-d78c9812692b,61651]); delete broader relation (null);
in scheme: sciencekeywords
definition: The composition and texture of molten rock outside of the Earth's crust.
type: Concept

ERUPTION DYNAMICS
type: Concept