MULTI-SPECTRAL
change note: 2015-06-04 10:51:47.0 [aaleman] added new keyword insert AltLabel (id: null text: Multispectral Camera language code: en); insert Definition (id: null text: A camera that captures multispectral images. The image data is captured at specific frequencies across the electromagnetic spectrum. language code: en);
change note: 2015-06-04 10:51:08.0 [aaleman] Insert Concept add broader relation (MULTI-SPECTRAL [0ff265ba-785f-498b-bee3-407c4317ac87,158005] - Cameras [d322ae9d-bde0-448f-948d-777aef096eb6,144973]);
in scheme: instruments
definition: A camera that captures multispectral images. The image data is captured at specific frequencies across the electromagnetic spectrum.
type: Concept

Cameras
type: Concept