Permanent Land Sites
type: Concept

GEODYNAMIC STATIONS
change note: 2021-11-17 13:59:50.0 [tstevens] Move Concepts delete broader relation (null); add broader relation (GEODYNAMIC STATIONS [106de241-cb93-4ccc-8255-71784fd14b0c,825980] - Permanent Land Sites [0ec10fd9-492c-498a-b6d8-e2840cc3643b,835887]);
in scheme: platforms
definition: Stations that make geodynmaic observations about the Earth.
type: Concept