Imaging Spectrometers/Radiometers
type: Concept

GSA
change note: 2015-08-03 11:31:59.0 [mpmorahan] insert AltLabel (id: null text: Hyperspectral imaging equipment language code: en);
change note: 2015-08-03 11:29:42.0 [mpmorahan] Insert Concept add broader relation (GSA [10deaf31-ae63-43a6-90b8-994487a71edb,158139] - Imaging Spectrometers/Radiometers [944b7691-af37-4fb4-9393-c114e7997829,144651]);
in scheme: instruments
definition: Earth Remote Sensing Instrument (GSA (1)) Group: Instrument_Details Entry_ID: GSA Group: Instrument_Identification Instrument_Category: Earth Remote Sensing Instruments Instrument_Class: Passive Remote Sensing Short_Name: GSA Long_Name: Hyperspectral imaging equipment End_Group Group: Associated_Platforms Short_Name: Resurs-P N1 Short_Name: Resurs-P N2 End_Group Group: Spectral_Frequency_Information Wavelength_Keyword: Visible Spectral_Frequency_Coverage_Range: 0.4 μm - 1.1 μm End_Group Group: Spectral_Frequency_Information Wavelength_Keyword: Near Infrared Spectral_Frequency_Coverage_Range: 0.4 μm - 1.1 μm End_Group Sample_Image: http://www.mcc.rsa.ru/Pic/pr/resurs_p/2.jpg Creation_Date: 2015-01-26 Group: Instrument_Logistics Instrument_Owner: Russia/ROSCOSMOS End_Group End_Group
type: Concept