COMEX
change note: 2021-10-08 14:31:41.0 [tstevens] Move Concepts delete broader relation (null); add broader relation (COMEX [10e3f0f0-f15f-4203-9481-8c5941ba1982,763848] - A - C [0c89f3f4-7ab1-43ce-89ee-795d35f0e30a,756999]);
change note: 2021-10-08 14:34:22.0 [tstevens] insert AltLabel (id: null category: primary text: CO2 and MEthane eXperiment language code: en); insert Definition (id: null text: The CO2 and MEthane eXperiment (COMEX) conducted in coordination with the HyspIRI campaign, demonstrated that methane emissions associated with fossil fuel production activities in the Bakersfield area were of sufficient magnitude and size for space-based observations. language code: en);
change note: 2021-10-08 14:29:24.0 [tstevens] Insert Concept add broader relation (COMEX [10e3f0f0-f15f-4203-9481-8c5941ba1982,763848] - Projects [fb0b9fcd-5c96-4989-8c64-a479bbed83ab,758654]);
in scheme: projects
type: Concept
definition: The CO2 and MEthane eXperiment (COMEX) conducted in coordination with the HyspIRI campaign, demonstrated that methane emissions associated with fossil fuel production activities in the Bakersfield area were of sufficient magnitude and size for space-based observations.

A - C
type: Concept