CEP/CAMPAM
in scheme: providers
definition: GulfBase is a database of resources about the Gulf of Mexico. The goal of this website is to regroup, synthesize, and make freely available Gulf of Mexico research information. Our vision is that GulfBase will help researchers, policy makers, and the general public work together to insure long-term sustainable use and conservation of the Gulf of Mexico. Summary Provided By: http://www.gulfbase.org/
type: Concept

CONSORTIA/INSTITUTIONS
type: Concept