FIRMS
change note: 2014-03-21 12:53:04.0 [mpmorahan] insert AltLabel (id: null text: Fire Information for Resource Management System language code: en);
change note: 2014-03-21 12:48:50.0 [mpmorahan] Insert Concept add broader relation (FIRMS [1201ce55-8d7e-414e-8ca6-b0867fce9105,106249] - D - F [24cf4b0e-4464-4edb-8f0c-415e851a6d79,77495]);
in scheme: projects
definition: FIRMS delivers global MODIS hotspots / fire locations in easy to use formats.
type: Concept

D - F
type: Concept