EPA/ORD/TSC
change note: 2012-11-14 14:32:56.0 [tbs1979] Insert Concept add broader relation (EPA/ORD/TSC [1274a35b-e7fb-4d02-8564-53ff852c0ef4,81991] - EPA [782baf09-4a51-4245-b913-40008bde17dd,66459]);
in scheme: providers
definition: There are five Technical Support Centers (TSC), in five laboratories, operated by the Office of Research and Development (ORD) and funded by the Office of Superfund Remediation and Technology Innovation and the Technical Support Project (TSP). Each TSC is dedicated to serving the EPA by supplying high-quality, quick-response technical support services when the scope of work is beyond that which is available to the Regions. The Environmental Sciences Division (ESD) in Las Vegas, NV operated the TSC until October 1, 2007. The TSC is currently operated through ORD's Office of Science Policy (OSP) and administered by the Superfund Technical Liaison program - Felicia Barnett in Region 4 is the acting TSC Director. The Las Vegas TSC began in 1987 and specialized in Superfund support to EPA's Remedial Project Managers (RPMs) and On-Scene Coordinators (OSCs). Since 1991, limited RCRA technical support is also available. When on-site work is required, the TSC mobilizes specialized teams of field scientists equipped with portable or deployable instruments to aid the Regions with screening and site characterization. The diversity of expertise available through our TSC allows us to work with the RPMs and OSCs throughout a site characterization event, i.e., from planning and design to analysis and data interpretation. Often these projects lead to identification of further research needs or development of protocols for experimental or sampling design.
type: Concept

EPA
type: Concept